{"text_format":"1","workbook":"xlsx","n_sheets":5,"sheets":["Generales","Principal","Personal","Normal","Recibo"],"not_rendered":{"charts":0,"images":0,"macros":0,"external_links":0,"defined_names":45,"comments":1,"pivot_tables":0},"unopened":[],"bounds":{"document_bytes":16777216,"sheet_cells":100000,"rows_first":2000,"rows_last":500,"rows_between":2000,"halvings":0,"cell_chars":16384,"cell_head_chars":4096},"cells_cut":0,"cells_raw":0,"read":"whole","date_system":"1900"}

{"sheet":"Generales","index":0,"n_rows":291,"n_cols":33,"rows_kept":291,"cut":false,"hidden":false,"merged":[[1,0,1,2]]}
[]
["Días de Vacaciones",null,null,null,"Categorías","Basicos","Ac 04/15",null,null,"Feriados",null,"Movilidad",null,"Seg Merc",null,"Tope","Normal",null,"Cargo","L Pagp",null,null,"Código","Situación",null,"Código","Condición",null,"Código","Modalidades",null,"Código","Obras Sociales"]
[null,"Antigüedad","Días",null,"Maestranza A",9907.9699999999993,null,null,null,"2015-01-01",null,270,null,406.25,null,"Max Aporte y LRT",43202.17,null,"Planilleros","Río Cuarto",null,null,0,"Baja por fallecimiento",null,1,"Servicios Comunes. Mayor de 18 años",null,0,"Contrato modalidad promovida .Reducción 0%",null,0,"Sin Obra Social"]
[">",0,14,null,"Maestranza B",9945.49,null,null,null,"2015-02-16",null,null,null,null,null,"Min Aporte y LRT",1329.31,null,"Recepcionista",null,null,null,1,"Activo",null,2,"Jubilado",null,1,"A tiempo parcial: Indeterminado o determinado",null,208,"o.s.del personal de la industria grafica de la provincia de cordoba"]
[">",5.01,21,null,"Maestranza C",10076.91,null,null,null,"2015-02-17",null,"Períodos",null,"Smvm",null,null,null,null,"Control Documetación",null,null,null,2,"Bajas otras causales",null,3,"Menor",null,2,"Becarios",null,307,"o.s.portuarios argentinos de mar del plata"]
[">",10.01,28,null,"Administrativo A",10048.76,null,null,null,"2015-03-23",null,"2015-01-01",null,5558,null,null,null,null,null,null,null,null,3,"Activo Decreto N° 796/97",null,4,"Menor anterior",null,3,"De aprendizaje. Ley N° 25.013",null,406,"o.s.del personal de organismos de control externo"]
[">",20.010000000000002,35,null,"Administrativo B",10105.07,null,null,null,"2015-03-24",null,"2015-02-01",null,null,null,null,null,null,null,null,null,null,4,"Baja otras causales Decreto N° 796/97",null,5,"Servicios Diferenciados Mayor de 18 años",null,4,"Especial de Fomento del Empleo. Ley N° 24.465",null,505,"o.s.de capitanes,pilotos y patrones de pesca"]
[null,null,null,null,"Administrativo C",10161.299999999999,null,null,null,"2015-04-02",null,"2015-03-01",null,"Div Hs Extras",null,null,null,null,null,null,null,null,5,"Maternidad y/o excedencia - En goce de vacaciones y otros.",null,6,"Sin Servicios Reales",null,5,"Fomento del empleo. Leyes N° 24.013 y N° 24.467",null,604,"o.s.de agentes de loterias y afines de la republica argentina"]
[null,null,null,null,"Administrativo D",10330.280000000001,null,null,null,"2015-04-03",null,"2015-04-01",null,200,null,null,null,null,null,null,null,null,6,"Suspendido/Conservación del empleo – Licencia s/goce de sueldo y otros.",null,7,"Medida de no innovar. Servicios Comunes",null,6,"Lanzamiento nueva actividad. Leyes N° 24.013 y N° 24.467",null,703,"mutual del personal de agua y energia de mendoza"]
[null,null,null,null,"Administrativo E",10471.07,null,null,null,"2015-05-01",null,"2015-05-01",null,null,null,null,null,null,null,null,null,null,7,"Baja por despido",null,8,"Medida de no innovar. Servicios Diferenciados",null,7,"Período de prueba. Leyes N° 24.465 y N° 25.013",null,901,"o.s.de la actividad de seguros,reaseguros,capitalizacion y ahorro y prestamo para la vivienda"]
[null,null,null,null,"Administrativo F",10677.54,null,null,null,"2015-05-25",null,"2015-06-01",null,"Remunerativo",null,null,null,null,null,null,null,null,8,"Baja por despido Decreto N° 796/97",null,9,"Jubilado Decreto. N° 206/00.",null,8,"Por tiempo indeterminado – tiempo determinado",null,1003,"o.s.del personal de obras y servicios sanitarios"]
[null,null,null,null,"Cajero A",10095.65,null,null,null,"2015-06-20",null,"2015-07-01",null,null,null,null,null,null,null,null,null,null,9,"Suspendido. Ley N° 20.744 art. 223bis",null,null,null,null,9,"Práctica laboral para jóvenes.",null,1102,"o.s.para la actividad docente"]
[null,null,null,null,"Cajero B",10161.299999999999,null,null,null,"2015-07-09",null,"2015-08-01",null,null,null,null,null,null,null,null,null,null,null,null,null,"Código","Régimen Jubilatorio",null,10,"Programa Nacional de pasantías. Decreto N° 340/92",null,1201,"o.s.para el personal del ministerio de economia y obras publicas"]
[null,null,null,null,"Cajero C",10245.82,null,null,null,"2015-08-17",null,"2015-09-01",null,"Exento",null,null,null,null,null,null,null,null,null,null,null,1,"SIPA",null,11,"Trabajo de temporada.",null,1300,"o.s.ferroviaria"]
[null,null,null,null,"Auxiliar A",10095.66,null,null,null,"2015-10-12",null,"2015-10-01",null,null,null,null,null,null,null,null,null,null,null,null,null,null,null,null,12,"Trabajo eventual.",null,1508,"os. asociacion civil pro sindicato amas de casa de la republica argentina"]
[null,null,null,null,"Auxiliar B",10189.52,null,null,null,"2015-11-23",null,"2015-11-01",null,null,null,null,null,null,null,null,null,null,null,null,null,"Código","CCT",null,13,"Trabajo formación.",null,1607,"o.s.del sindicato unido de trabajadores de la industria de aguas gaseosas de la provincia de santa fe"]
[null,null,null,null,"Auxiliar C",10499.22,null,null,null,"2015-12-07",null,"2015-12-01",null,"Seg Vida",null,null,null,null,null,null,null,null,null,null,null,1,"130/75",null,14,"Nuevo período de prueba",null,1706,"o.s.del personal jerarquico de la republica argentina para el personal jerarquico de la industria grafica  y el personal jerarquico de agua y energia"]
[null,null,null,null,"Auxiliar Esp A",10208.290000000001,null,null,null,"2015-12-08",null,null,null,4.0999999999999996,null,null,null,null,null,null,null,null,null,null,null,null,null,null,15,"Puesto Nuevo varones 25 a 44 y mujeres de 25 ó más años",null,1805,"obra social de legisladores de la republica argentina"]
[null,null,null,null,"Auxiliar Esp B",10377.209999999999,null,null,null,"2015-12-25",null,null,null,null,null,null,null,null,null,null,null,null,null,null,null,null,null,null,16,"Nuevo período de prueba. Trabajador Discapacitado. Art. 34. Ley N° 24.147",null,1904,"o.s.de la federacion de camaras y centros comerciales zonales de la republica argentina"]
[null,null,null,null,"Vendedor A",10095.65,null,null,null,null,null,null,null,"Tipos",null,null,null,null,null,null,null,null,null,null,null,null,null,null,17,"Puesto nuevo menor de 25, varón de 45 ó más y mujer jefe de familia s/límite/edad",null,2105,"o.s. profesionales del turf de la republica argentina"]
[null,null,null,null,"Vendedor B",10377.209999999999,null,null,null,null,null,null,null,"Remunerativo",null,null,null,null,null,null,null,null,null,null,null,null,null,null,18,"Trabajador Discapacitado. Art. 34. Ley N° 24.147",null,2204,"os. empleados y personal jerarquico del neumatico argentino de neumaticos good year s.r.l."]
[null,null,null,null,"Vendedor C",10471.07,null,null,null,null,null,null,null,"Exento",null,null,null,null,null,null,null,null,null,null,null,null,null,null,19,"Puesto nuevo varones 25 a 44 y mujeres de 25 ó más años. Art. 34. Ley N° 24.147",null,2303,"o.s. para el personal de empresas de limpieza, servicios y maestranza de mendoza"]
[null,null,null,null,"Vendedor D",10677.54,null,null,null,null,null,null,null,"Salario Familiar",null,null,null,null,null,null,null,null,null,null,null,null,null,null,20,"Puesto nuevo menor de 25. Varón de 45 ó más y mujer jefe de familia s/límite/edad. Art. 34. Ley N° 24.147",null,2402,"o.s. del personal jerarquico del transporte automotor de pasajeros de cordoba y afines"]
[null,null,null,null,null,null,null,null,null,null,null,null,null,"Retención",null,null,null,null,null,null,null,null,null,null,null,null,null,null,50,"Contrato modalidad promovida. Reducción 50%",null,2501,"o.s.de ministros, secretarios y subsecretarios"]
[null,null,null,null,null,null,null,null,null,null,null,null,null,"Contr.Patronal",null,null,null,null,null,null,null,null,null,null,null,null,null,null,100,"Contrato modalidad promovida. Reducción 100%",null,2600,"o.s. de la trabajadores de la carne y afines de la r.a."]
[null,null,null,null,null,null,null,null,null,null,null,null,null,null,null,null,null,null,null,null,null,null,null,null,null,null,null,null,null,null,null,2709,"os de los trabajadores asociados a la asociacion mutual mercantil argentina (ostamma)"]
[null,null,null,null,null,null,null,null,null,null,null,null,null,null,null,null,null,null,null,null,null,null,null,null,null,null,null,null,null,null,null,2808,"os de la camara de empresarios de agencias de remises de la provincia de buenos aires (o.s.c.e.a.r.b.a)"]
[null,null,null,null,null,null,null,null,null,null,null,null,null,null,null,null,null,null,null,null,null,null,null,null,null,null,null,null,null,null,null,2907,"o. s. asociacion mutual metalurgica villa constitucion (o.s.a.m.m.v.c)"]
[null,null,null,null,null,null,null,null,null,null,null,null,null,null,null,null,null,null,null,null,null,null,null,null,null,null,null,null,null,null,null,3009,"o.s.personal asociado a asoc.mutual sancor (o.s.pers.a.a.m.s)"]
[null,null,null,null,null,null,null,null,null,null,null,null,null,null,null,null,null,null,null,null,null,null,null,null,null,null,null,null,null,null,null,100106,"o.s.para el personal de la industria aceitera y afines"]
[null,null,null,null,null,null,null,null,null,null,null,null,null,null,null,null,null,null,null,null,null,null,null,null,null,null,null,null,null,null,null,100205,"o.s.de  actores"]
[null,null,null,null,null,null,null,null,null,null,null,null,null,null,null,null,null,null,null,null,null,null,null,null,null,null,null,null,null,null,null,100304,"o.s.de  tecnicos de vuelo de lineas aereas"]
[null,null,null,null,null,null,null,null,null,null,null,null,null,null,null,null,null,null,null,null,null,null,null,null,null,null,null,null,null,null,null,100403,"o.s.del personal superior y profesional de empresas aerocomerciales"]
[null,null,null,null,null,null,null,null,null,null,null,null,null,null,null,null,null,null,null,null,null,null,null,null,null,null,null,null,null,null,null,100502,"o.s.del personal aeronautico"]
[null,null,null,null,null,null,null,null,null,null,null,null,null,null,null,null,null,null,null,null,null,null,null,null,null,null,null,null,null,null,null,100601,"o.s.del personal aeronavegacion de entes privados"]
[null,null,null,null,null,null,null,null,null,null,null,null,null,null,null,null,null,null,null,null,null,null,null,null,null,null,null,null,null,null,null,100700,"o.s.del personal tecnico aeronautico"]
[null,null,null,null,null,null,null,null,null,null,null,null,null,null,null,null,null,null,null,null,null,null,null,null,null,null,null,null,null,null,null,100809,"o.s.de  aeronavegantes"]
[null,null,null,null,null,null,null,null,null,null,null,null,null,null,null,null,null,null,null,null,null,null,null,null,null,null,null,null,null,null,null,100908,"o.s.de empleados de agencias de informes"]
[null,null,null,null,null,null,null,null,null,null,null,null,null,null,null,null,null,null,null,null,null,null,null,null,null,null,null,null,null,null,null,101000,"o.s.del personal de aguas gaseosas y afines"]
[null,null,null,null,null,null,null,null,null,null,null,null,null,null,null,null,null,null,null,null,null,null,null,null,null,null,null,null,null,null,null,101109,"o.s.de alfajoreros,reposteros,pizzeros y heladeros (mar del plata y aledaños"]
[null,null,null,null,null,null,null,null,null,null,null,null,null,null,null,null,null,null,null,null,null,null,null,null,null,null,null,null,null,null,null,101208,"o.s.del personal de la industria de la alimentacion"]
[null,null,null,null,null,null,null,null,null,null,null,null,null,null,null,null,null,null,null,null,null,null,null,null,null,null,null,null,null,null,null,101604,"o.s.del personal del automovil club argentino"]
[null,null,null,null,null,null,null,null,null,null,null,null,null,null,null,null,null,null,null,null,null,null,null,null,null,null,null,null,null,null,null,101802,"o.s.del personal de azucar del ingenio la esperanza"]
[null,null,null,null,null,null,null,null,null,null,null,null,null,null,null,null,null,null,null,null,null,null,null,null,null,null,null,null,null,null,null,101901,"o.s.del personal de azucar del ingenio ledesma"]
[null,null,null,null,null,null,null,null,null,null,null,null,null,null,null,null,null,null,null,null,null,null,null,null,null,null,null,null,null,null,null,102102,"o.s.del personal de azucar del ingenio rio grande"]
[null,null,null,null,null,null,null,null,null,null,null,null,null,null,null,null,null,null,null,null,null,null,null,null,null,null,null,null,null,null,null,102300,"o.s.del personal de azucar del ingenio san martin"]
[null,null,null,null,null,null,null,null,null,null,null,null,null,null,null,null,null,null,null,null,null,null,null,null,null,null,null,null,null,null,null,102706,"o.s.del personal de la industria azucarera"]
[null,null,null,null,null,null,null,null,null,null,null,null,null,null,null,null,null,null,null,null,null,null,null,null,null,null,null,null,null,null,null,102904,"o.s.del personal de barracas de lanas,cueros y anexos"]
[null,null,null,null,null,null,null,null,null,null,null,null,null,null,null,null,null,null,null,null,null,null,null,null,null,null,null,null,null,null,null,103006,"o.s.del personal de la industria botonera"]
[null,null,null,null,null,null,null,null,null,null,null,null,null,null,null,null,null,null,null,null,null,null,null,null,null,null,null,null,null,null,null,103105,"o.s.del personal de la industria del calzado"]
[null,null,null,null,null,null,null,null,null,null,null,null,null,null,null,null,null,null,null,null,null,null,null,null,null,null,null,null,null,null,null,103204,"o.s.de conductores camioneros y personal del transporte automotor de cargas"]
[null,null,null,null,null,null,null,null,null,null,null,null,null,null,null,null,null,null,null,null,null,null,null,null,null,null,null,null,null,null,null,103402,"o.s.del personal de carga y descarga"]
[null,null,null,null,null,null,null,null,null,null,null,null,null,null,null,null,null,null,null,null,null,null,null,null,null,null,null,null,null,null,null,103600,"o.s.del personal auxiliar de casas particulares"]
[null,null,null,null,null,null,null,null,null,null,null,null,null,null,null,null,null,null,null,null,null,null,null,null,null,null,null,null,null,null,null,103709,"o.s.del personal de la industria del caucho"]
[null,null,null,null,null,null,null,null,null,null,null,null,null,null,null,null,null,null,null,null,null,null,null,null,null,null,null,null,null,null,null,103808,"o.s.del personal del caucho"]
[null,null,null,null,null,null,null,null,null,null,null,null,null,null,null,null,null,null,null,null,null,null,null,null,null,null,null,null,null,null,null,103907,"o.s.del personal de la industria del caucho de santa fe"]
[null,null,null,null,null,null,null,null,null,null,null,null,null,null,null,null,null,null,null,null,null,null,null,null,null,null,null,null,null,null,null,104009,"o.s.del personal de cementerios de la republica argentina"]
[null,null,null,null,null,null,null,null,null,null,null,null,null,null,null,null,null,null,null,null,null,null,null,null,null,null,null,null,null,null,null,104108,"o.s.de ceramistas"]
[null,null,null,null,null,null,null,null,null,null,null,null,null,null,null,null,null,null,null,null,null,null,null,null,null,null,null,null,null,null,null,104207,"o.s.del personal de la ceramica,sanitarios,porcelanas de mesa y afines"]
[null,null,null,null,null,null,null,null,null,null,null,null,null,null,null,null,null,null,null,null,null,null,null,null,null,null,null,null,null,null,null,104306,"o.s.del personal de la actividad cervecera y afines"]
{"$rows_left_out":232}
{"sheet":"Principal","index":1,"n_rows":22,"n_cols":8,"rows_kept":22,"cut":false,"hidden":false,"merged":[[3,1,3,3],[3,5,3,7]]}
[null,"Sistema de Liquidación de Sueldos y Jornales"]
[null,"Cátedra de Gestión Informatizada - Facultad de Cs.Económicas - UNRC"]
[]
[null,"Parámetros Generales",null,null,null,"Personal a Liquidar"]
[null,null,null,null,null,"Apellido y Nombre",null,"Barrientos Sebastian"]
[null,"Día de Liquidación",null,"2015-08-31",null,"CUIL",null,{"$f":"VLOOKUP(Nombre,Personal,MATCH(F6,Campos_Personal,0),0)","v":20066362311}]
[null,"Días en el Mes",null,{"$f":"DAY(EOMONTH(Dia_liquidacion,0))","v":31},null,"Fecha de Ingreso",null,{"$f":"VLOOKUP(Nombre,Personal,MATCH(F7,Campos_Personal,0),0)","v":"2006-04-01"}]
[null,null,null,null,null,"Categoría",null,{"$f":"VLOOKUP(Nombre,Personal,MATCH(F8,Campos_Personal,0),0)","v":"Administrativo B"}]
[null,"Vacaciones al",null,"2015-12-31",null,"Cargo",null,{"$f":"VLOOKUP(Nombre,Personal,MATCH(F9,Campos_Personal,0),0)","v":"Control Documetación"}]
[null,null,null,null,null,"Sueldo Básico",null,{"$f":"VLOOKUP(Nombre,Personal,MATCH(F10,Campos_Personal,0),0)","v":10105.07}]
[null,null,null,null,null,"Antigüedad"]
[null,null,null,null,null,"Días Trabajados",null,{"$f":"Días_en_el_Mes-Dias_Injustificados","v":31}]
[null,null,null,null,null,"Ausencias Injustificadas"]
[null,"Datos de la Empresa",null,null,null,"Horas Extras 50%"]
[null,"Razón Social",null,"Empresa S.R.L.",null,"Horas Extras 100%"]
[null,"Domicilio",null,"Cuba Nº 1924",null,"CCT",null,{"$f":"VLOOKUP(Nombre,Personal,MATCH(F16,Campos_Personal,0),0)","v":"130/75"}]
[null,"Localidad",null,"(5800)-Río Cuarto",null,"Adherente Obra Social",null,{"$f":"VLOOKUP(Nombre,Personal,MATCH(F17,Campos_Personal,0),0)","v":0}]
[null,"CUIT",null,"30-99999999-5",null,"Días de Vacaciones"]
[null,"Tipo Empleador",null,"Dec 814/01 Art 2 Inc B"]
[null,"Actividad",null,"Actividades No Clasificadas"]
[null,"Zona Sicoss",null,"Cordoba"]
[null,"Zona D 814/01",null,"Resto Cba"]

{"sheet":"Personal","index":2,"n_rows":4,"n_cols":27,"rows_kept":4,"cut":false,"hidden":false,"merged":[]}
["Legajo","Nombre","Nº Docum","CUIL","Domicilio","Numero","Dpto","Piso","C.Postal","Localidad","Fecha Nacim","E.Civil","Adherente Obra Social","Categoría","Cargo","Lugar Pago","Sueldo Básico","Régimen Jubilatorio","Obra Social","Situación","Condición","Modalidad","CCT","Fecha de Ingreso","Mejor Remunerativo Anual","Remunerativo para SAC","Remunerativo para Vac"]
["0001","Constanso Hector",6650949,20066509495,"Posadas",342,null,null,5800,"RIO CUARTO","1978-02-05","C",1,"Administrativo A","Planilleros","Río Cuarto",{"$f":"VLOOKUP(N2,Basicos,2,0)","v":10048.76},"SIPA","o.s.de los empleados de comercio y actividades civiles","Activo","Servicios Comunes. Mayor de 18 años","Por tiempo indeterminado – tiempo determinado","130/75","2001-09-01"]
["0002","Barrientos Sebastian",6636231,20066362311,"Bolivia",455,null,null,5800,"RIO CUARTO","1975-04-04","C",null,"Administrativo B","Control Documetación","Río Cuarto",{"$f":"VLOOKUP(N3,Basicos,2,0)","v":10105.07},"SIPA","o.s.de los empleados de comercio y actividades civiles","Activo","Servicios Comunes. Mayor de 18 años","Por tiempo indeterminado – tiempo determinado","130/75","2006-04-01"]
["0003","Ventura Lidia",16118724,27161187246,"Maipú",2345,null,null,5800,"RIO CUARTO","1963-11-25","S",null,"Administrativo A","Recepcionista","Río Cuarto",{"$f":"VLOOKUP(N4,Basicos,2,0)","v":10048.76},"SIPA","o.s.de los empleados de comercio y actividades civiles","Activo","Servicios Comunes. Mayor de 18 años","Por tiempo indeterminado – tiempo determinado","130/75","2000-03-01"]

{"sheet":"Normal","index":3,"n_rows":30,"n_cols":6,"rows_kept":30,"cut":false,"hidden":false,"merged":[[0,0,0,5],[1,0,1,5]]}
["Liquidación Normal"]
["Conceptos Liquidables - Fórmulas para el cálculo"]
["Código","Nombre","Fórmula","Tipo","Liquida","Valor"]
[1,"Sueldo Básico",{"$f":"ROUND(Sueldo_Basico/Días_en_el_Mes*Días_Trabajados,2)","v":10105.07},"Remunerativo","Sí",{"$f":"IF(E4=\"Sí\",C4,0)","v":10105.07}]
[2,"Antigüedad",null,null,null,{"$f":"IF(E5=\"Sí\",C5,0)","v":0}]
[3,"Presentismo",null,null,null,0]
[4,"Acuerdo Abril 2015",null,null,null,0]
[6,"Horas Extras 50%",null,null,null,0]
[7,"Horas Extras 100%",null,null,null,0]
[8,"Movilidad",null,null,null,0]
[100,"Jubilación",null,null,null,0]
[101,"Ley 19032",null,null,null,0]
[102,"Obra Social",null,null,null,0]
[103,"Fondo Solidario Redistrib",null,null,null,0]
[104,"Adherente Obra Social",null,null,null,0]
[105,"Art 100 - Fondo Asist",null,null,null,0]
[106,"Art 100 - FAECyS",null,null,null,0]
[111,"Seguro Vida Mercantil",null,null,null,0]
[112,"Retención Judicial (Embargo)",null,null,null,0]
[300,"SIJP",null,null,null,0]
[301,"INSSJP",null,null,null,0]
[302,"FNE",null,null,null,0]
[303,"Asignacion Familiar",null,null,null,0]
[304,"Contribucion Obra Social",null,null,null,0]
[305,"Contribucion Fondo Sol Red",null,null,null,0]
[306,"ART",null,null,null,0]
[307,"Seguro de Vida Dec 1567/74",null,null,null,0]
[308,"Seguro Vida Mercantil",null,null,null,0]
[309,"Contribucion INACAP",null,null,null,0]
[310,"Seguro Retiro Complement",null,null,null,0]

{"sheet":"Recibo","index":4,"n_rows":42,"n_cols":10,"rows_kept":42,"cut":false,"hidden":false,"merged":[[1,1,1,2],[2,1,2,2],[1,6,1,7],[2,6,2,7]]}
[]
[null,{"$f":"\"Empresa: \" & Principal!D15","v":"Empresa: Empresa S.R.L."},null,{"$f":"\"C.U.I.T.: \" & Principal!D18","v":"C.U.I.T.: 30-99999999-5"},null,null,{"$f":"B2","v":"Empresa: Empresa S.R.L."},null,{"$f":"D2","v":"C.U.I.T.: 30-99999999-5"}]
[null,{"$f":"\"Domicilio: \" & Principal!D16","v":"Domicilio: Cuba Nº 1924"},null,{"$f":" \"Localidad: \" & Principal!D17","v":"Localidad: (5800)-Río Cuarto"},null,null,{"$f":"B3","v":"Domicilio: Cuba Nº 1924"},null,{"$f":"D3","v":"Localidad: (5800)-Río Cuarto"}]
[null,null,null,null,null,null,{"$f":"IF(B4=\"\",\"\",B4)","v":""},{"$f":"IF(C4=\"\",\"\",C4)","v":""},{"$f":"IF(D4=\"\",\"\",D4)","v":""},{"$f":"IF(E4=\"\",\"\",E4)","v":""}]
[null,"Apellido y Nombre","Fec. Ingreso","C.U.I.L.","Recibo Nº",null,"Apellido y Nombre","Fec. Ingreso","C.U.I.L.","Recibo Nº"]
[null,{"$f":"Nombre","v":"Barrientos Sebastian"},{"$f":"Fecha_Ingreso","v":"2006-04-01"},{"$f":"CUIL","v":20066362311},null,null,"Barrientos Sebastian","2006-04-01",20066362311,""]
[null,"Período de Pago","Categoría","Calificación","Rem. Básica",null,"Período de Pago","Categoría","Calificación","Rem. Básica"]
[null,null,{"$f":"Categoría","v":"Administrativo B"},{"$f":"Calificación","v":"Control Documetación"},{"$f":"Sueldo_Basico","v":10105.07},null,"","Administrativo B","Control Documetación",10105.07]
[null,"Conceptos","Remunerativos","Exentos","Retenciones",null,"Conceptos","Remunerativos","Exentos","Retenciones"]
[null,null,null,null,null,null,{"$f":"IF(B10=\"\",\"\",B10)","v":""},"","",""]
[null,null,null,null,null,null,{"$f":"IF(B11=\"\",\"\",B11)","v":""},{"$f":"IF(C11=\"\",\"\",C11)","v":""},{"$f":"IF(D11=\"\",\"\",D11)","v":""},{"$f":"IF(E11=\"\",\"\",E11)","v":""}]
[null,null,null,null,null,null,"","","",""]
[null,null,null,null,null,null,"","","",""]
[null,null,null,null,null,null,"","","",""]
[null,null,null,null,null,null,"","","",""]
[null,null,null,null,null,null,"","","",""]
[null,null,null,null,null,null,"","","",""]
[null,null,null,null,null,null,"","","",""]
[null,null,null,null,null,null,"","","",""]
[null,null,null,null,null,null,"","","",""]
[null,null,null,null,null,null,"","","",""]
[null,null,null,null,null,null,"","","",""]
[null,null,null,null,null,null,"","","",""]
[null,null,null,null,null,null,"","","",""]
[null,null,null,null,null,null,"","","",""]
[null,null,null,null,null,null,"","","",""]
[null,null,null,null,null,null,"","","",""]
[null,null,null,null,null,null,"","","",""]
[null,null,{"$f":"IFERROR(IF(VLOOKUP($B29,Normal!$B$4:$F$30,3,0)=\"Remunerativo\",VLOOKUP($B29,Normal!$B$4:$F$30,5,0),0),\"\")","v":""},{"$f":"IFERROR(IF(VLOOKUP($B29,Normal!$B$4:$F$30,3,0)=\"Exento\",VLOOKUP($B29,Normal!$B$4:$F$30,5,0),0),\"\")","v":""},{"$f":"IFERROR(IF(VLOOKUP($B29,Normal!$B$4:$F$30,3,0)=\"Retención\",VLOOKUP($B29,Normal!$B$4:$F$30,5,0),0),\"\")","v":""},null,"","","",""]
[null,null,{"$f":"IFERROR(IF(VLOOKUP($B30,Normal!$B$4:$F$30,3,0)=\"Remunerativo\",VLOOKUP($B30,Normal!$B$4:$F$30,5,0),0),\"\")","v":""},{"$f":"IFERROR(IF(VLOOKUP($B30,Normal!$B$4:$F$30,3,0)=\"Exento\",VLOOKUP($B30,Normal!$B$4:$F$30,5,0),0),\"\")","v":""},{"$f":"IFERROR(IF(VLOOKUP($B30,Normal!$B$4:$F$30,3,0)=\"Retención\",VLOOKUP($B30,Normal!$B$4:$F$30,5,0),0),\"\")","v":""},null,"","","",""]
[null,null,{"$f":"IFERROR(IF(VLOOKUP($B31,Normal!$B$4:$F$30,3,0)=\"Remunerativo\",VLOOKUP($B31,Normal!$B$4:$F$30,5,0),0),\"\")","v":""},{"$f":"IFERROR(IF(VLOOKUP($B31,Normal!$B$4:$F$30,3,0)=\"Exento\",VLOOKUP($B31,Normal!$B$4:$F$30,5,0),0),\"\")","v":""},{"$f":"IFERROR(IF(VLOOKUP($B31,Normal!$B$4:$F$30,3,0)=\"Retención\",VLOOKUP($B31,Normal!$B$4:$F$30,5,0),0),\"\")","v":""},null,"","","",""]
[null,null,{"$f":"SUM(C11:C31)","v":0},{"$f":"SUM(D11:D31)","v":0},{"$f":"SUM(E11:E31)","v":0},null,null,{"$f":"IF(C32=\"\",\"\",C32)","v":0},{"$f":"IF(D32=\"\",\"\",D32)","v":0},{"$f":"IF(E32=\"\",\"\",E32)","v":0}]
[null,null,null,"Neto a Cobrar",{"$f":"C32+D32-E32","v":0},null,null,null,{"$f":"D33","v":"Neto a Cobrar"},{"$f":"IF(E33=\"\",\"\",E33)","v":0}]
[]
[null,"Lugar y Fecha de Pago:",null,null,null,null,{"$f":"B35","v":"Lugar y Fecha de Pago:"}]
[]
[null,"Son Pesos:",null,null,null,null,{"$f":"B37","v":"Son Pesos:"}]
[]
[null,null,null,null,"                                   ",null,null,null,null,"                                   "]
[null,"Mes:",null,null,null,null,{"$f":"B40","v":"Mes:"}]
[null,"Banco:",null,null,null,null,{"$f":"B41","v":"Banco:"}]
[null,"Fecha depósito:",null,null,null,null,"Fecha depósito:"]